Target
cAMP-dependent protein kinase catalytic subunit alpha
Ligand
BDBM37899
Substrate
Meas. Tech.
Dose-response biochemical assay for inhibitors of protein kinase A (PKA) activity
IC50
>59640±n/a nM
Citation
 PubChem, PC Dose-response biochemical assay for inhibitors of protein kinase A (PKA) activity PubChem Bioassay (2007)[AID] 
Target
Name:
cAMP-dependent protein kinase catalytic subunit alpha
Synonyms:
KAPCA_HUMAN PKACA cAMP-dependent protein kinase (PKA) cAMP-dependent protein kinase catalytic subunit alpha cAMP-dependent protein kinase catalytic subunit alpha (PKACA) cAMP-dependent protein kinase catalytic subunit alpha isoform 1 | cAMP-dependent protein kinase, alpha-catalytic subunit
Type:
Enzyme Catalytic Subunit
Mol. Mass.:
40598.73
Organism:
Homo sapiens (Human)
Description:
Residue:
351
  
Inhibitor
Name:
BDBM37899
Synonyms:
MLS000086255 N-(1,3-benzodioxol-5-yl)-2-(3-methyl-1-oxidanylidene-isoquinolin-2-yl)ethanamide N-(1,3-benzodioxol-5-yl)-2-(3-methyl-1-oxoisoquinolin-2-yl)acetamide SMR000021764 | cid_3236683
Type:
Small organic molecule
Emp. Form.:
C19H16N2O4
Mol. Mass.:
336.3413
SMILES:
Cc1cc2ccccc2c(=O)n1CC(=O)Nc1ccc2OCOc2c1
: