Target
Macrophage migration inhibitory factor
Ligand
BDBM50206091
Substrate
Meas. Tech.
Inhibition of Tautomerase Activity of Human MIF
Ki
82.0±n/a nM
Citation
 Jorgensen, WLDziedzic, PCisneros, J Biaryltriazole inhibitors of macrophage migration inhibitory factor US Patent  US10336721 Publication Date 7/2/2019 
Target
Name:
Macrophage migration inhibitory factor
Synonyms:
GIF Glycosylation-inhibiting factor L-dopachrome tautomerase MIF/CD74 (Macrophage migration inhibitory factor and HLA-DR antigens-associated invariant chain) MMIF Macrophage migration inhibitory factor (MIF) | Phenylpyruvate tautomerase
Type:
Enzyme
Mol. Mass.:
12478.18
Organism:
Homo sapiens (Human)
Description:
P14174
Residue:
115
  
Inhibitor
Name:
BDBM50206091
Synonyms:
CHEMBL3918231 US10968198, Example 25
Type:
Small organic molecule
Emp. Form.:
C26H21FN4O4
Mol. Mass.:
472.4677
SMILES:
COCCOc1cccc(Oc2cccc3nc(ccc23)-c2cn(nn2)-c2ccc(O)c(F)c2)c1
: