Target
Macrophage migration inhibitory factor
Ligand
BDBM403785
Substrate
Meas. Tech.
Inhibition of Tautomerase Activity of Human MIF
Ki
45.0±n/a nM
Citation
 Jorgensen, WLDziedzic, PCisneros, J Biaryltriazole inhibitors of macrophage migration inhibitory factor US Patent  US10336721 Publication Date 7/2/2019 
Target
Name:
Macrophage migration inhibitory factor
Synonyms:
GIF Glycosylation-inhibiting factor L-dopachrome tautomerase MIF/CD74 (Macrophage migration inhibitory factor and HLA-DR antigens-associated invariant chain) MMIF Macrophage migration inhibitory factor (MIF) | Phenylpyruvate tautomerase
Type:
Enzyme
Mol. Mass.:
12478.18
Organism:
Homo sapiens (Human)
Description:
P14174
Residue:
115
  
Inhibitor
Name:
BDBM403785
Synonyms:
US10336721, Example 44
Type:
Small organic molecule
Emp. Form.:
C21H17FN4O5
Mol. Mass.:
424.3819
SMILES:
Oc1ccc(cc1F)-n1cc(nn1)-c1ccc2cc(OCCOCOC=O)ccc2n1
: