Target
Diphosphomevalonate decarboxylase
Ligand
BDBM38315
Substrate
Meas. Tech.
Screening for Inhibitors of the Mevalonate Pathway in Streptococcus Pneumoniae - DPM-DC Dose Response
IC50
18619.1±n/a nM
Citation
 PubChem, PC Screening for Inhibitors of the Mevalonate Pathway in Streptococcus Pneumoniae - DPM-DC Dose Response PubChem Bioassay (2007)[AID] 
Target
Name:
Diphosphomevalonate decarboxylase
Synonyms:
Type:
Enzyme Catalytic Domain
Mol. Mass.:
35571.44
Organism:
Streptococcus pneumoniae D39
Description:
A0A0H2ZN59
Residue:
317
  
Inhibitor
Name:
BDBM38315
Synonyms:
4-[[(2E)-2-(6-ketocyclohexa-2,4-dien-1-ylidene)-6-methyl-1H-pyrimidin-4-yl]amino]benzoic acid methyl ester MLS000039265 cid_5389168 methyl 4-[[(2E)-6-methyl-2-(6-oxocyclohexa-2,4-dien-1-ylidene)-1H-pyrimidin-4-yl]amino]benzoate
Type:
Small organic molecule
Emp. Form.:
C19H17N3O3
Mol. Mass.:
335.3566
SMILES:
COC(=O)c1ccc(Nc2cc(C)nc(n2)-c2ccccc2O)cc1
: