Target
Diphosphomevalonate decarboxylase
Ligand
BDBM38361
Substrate
Meas. Tech.
Screening for Inhibitors of the Mevalonate Pathway in Streptococcus Pneumoniae - DPM-DC Dose Response
IC50
2647.9±n/a nM
Citation
 PubChem, PC Screening for Inhibitors of the Mevalonate Pathway in Streptococcus Pneumoniae - DPM-DC Dose Response PubChem Bioassay (2007)[AID] 
Target
Name:
Diphosphomevalonate decarboxylase
Synonyms:
Type:
Enzyme Catalytic Domain
Mol. Mass.:
35571.44
Organism:
Streptococcus pneumoniae D39
Description:
A0A0H2ZN59
Residue:
317
  
Inhibitor
Name:
BDBM38361
Synonyms:
2-(4-pyrrolidin-1-ylsulfonylphenyl)-1,2-benzothiazol-3-one 2-[4-(1-pyrrolidinylsulfonyl)phenyl]-1,2-benzothiazol-3-one SMR000060746 | cid_2325816
Type:
Small organic molecule
Emp. Form.:
C17H16N2O3S2
Mol. Mass.:
360.451
SMILES:
O=c1n(sc2ccccc12)-c1ccc(cc1)S(=O)(=O)N1CCCC1
: