Target
Dual specificity protein phosphatase 6
Ligand
BDBM32004
Substrate
Meas. Tech.
In vitro MKP-3 Phosphatase Dose Response Hit/Probe Assessment Assay
IC50
18263±n/a nM
Citation
 PubChem, PC In vitro MKP-3 Phosphatase Dose Response Hit/Probe Assessment Assay PubChem Bioassay (2007)[AID] 
Target
Name:
Dual specificity protein phosphatase 6
Synonyms:
DUS6_RAT MAP kinase phosphatase 3 Mitogen-activated protein kinase phosphatase 3 | Mkp3
Type:
Enzyme
Mol. Mass.:
42303.19
Organism:
Rattus norvegicus
Description:
gi_16758752
Residue:
381
  
Inhibitor
Name:
BDBM32004
Synonyms:
2-(3-Oxo-1,3-dihydro-indol-2-ylidene)-indan-1,3-dione 2-(3-oxidanylidene-1H-indol-2-ylidene)indene-1,3-dione MLS000071738 cid_649556
Type:
Small organic molecule
Emp. Form.:
C17H9NO3
Mol. Mass.:
275.2583
SMILES:
O=[#6]-1\[#6](-[#7]-c2ccccc-12)=[#6]-1/[#6](=O)-c2ccccc2-[#6]-1=O
: