Target
Dual specificity protein phosphatase 6
Ligand
BDBM35365
Substrate
Meas. Tech.
In vitro MKP-3 Phosphatase Dose Response Hit/Probe Assessment Assay
IC50
>50000±n/a nM
Citation
 PubChem, PC In vitro MKP-3 Phosphatase Dose Response Hit/Probe Assessment Assay PubChem Bioassay (2007)[AID] 
Target
Name:
Dual specificity protein phosphatase 6
Synonyms:
DUS6_RAT MAP kinase phosphatase 3 Mitogen-activated protein kinase phosphatase 3 | Mkp3
Type:
Enzyme
Mol. Mass.:
42303.19
Organism:
Rattus norvegicus
Description:
gi_16758752
Residue:
381
  
Inhibitor
Name:
BDBM35365
Synonyms:
3-keto-4-([1,2,4]triazolo[3,4-b][1,3]benzothiazol-1-ylthio)butyric acid ethyl ester MLS000036836 cid_660612 ethyl 3-oxo-4-([1,2,4]triazolo[3,4-b][1,3]benzothiazol-1-ylsulfanyl)butanoate
Type:
Small organic molecule
Emp. Form.:
C14H13N3O3S2
Mol. Mass.:
335.401
SMILES:
CCOC(=O)CC(=O)CSc1nnc2sc3ccccc3n12
: