Target
Dual specificity protein phosphatase 6
Ligand
BDBM31700
Substrate
Meas. Tech.
In vitro MKP-3 Phosphatase Dose Response Hit/Probe Assessment Assay
IC50
21493±n/a nM
Citation
 PubChem, PC In vitro MKP-3 Phosphatase Dose Response Hit/Probe Assessment Assay PubChem Bioassay (2007)[AID] 
Target
Name:
Dual specificity protein phosphatase 6
Synonyms:
DUS6_RAT MAP kinase phosphatase 3 Mitogen-activated protein kinase phosphatase 3 | Mkp3
Type:
Enzyme
Mol. Mass.:
42303.19
Organism:
Rattus norvegicus
Description:
gi_16758752
Residue:
381
  
Inhibitor
Name:
BDBM31700
Synonyms:
(5Z)-5-(5-bromo-2-methoxybenzylidene)-2-(2-furyl)[1,3]thiazolo[3,2-b][1,2,4]triazol-6(5H)-one 5-[(5-bromanyl-2-methoxy-phenyl)methylidene]-2-(furan-2-yl)-[1,3]thiazolo[3,2-b][1,2,4]triazol-6-one 5-[(5-bromo-2-methoxyphenyl)methylidene]-2-(furan-2-yl)-[1,3]thiazolo[3,2-b][1,2,4]triazol-6-one SMR000020576 | cid_3236807
Type:
Small organic molecule
Emp. Form.:
C16H10BrN3O3S
Mol. Mass.:
404.238
SMILES:
COc1ccc(Br)cc1C=c1sc2nc(nn2c1=O)-c1ccco1
: