Target
Dual specificity protein phosphatase 6
Ligand
BDBM35408
Substrate
Meas. Tech.
In vitro MKP-3 Phosphatase Dose Response Hit/Probe Assessment Assay
IC50
>50000±n/a nM
Citation
 PubChem, PC In vitro MKP-3 Phosphatase Dose Response Hit/Probe Assessment Assay PubChem Bioassay (2007)[AID] 
Target
Name:
Dual specificity protein phosphatase 6
Synonyms:
DUS6_RAT MAP kinase phosphatase 3 Mitogen-activated protein kinase phosphatase 3 | Mkp3
Type:
Enzyme
Mol. Mass.:
42303.19
Organism:
Rattus norvegicus
Description:
gi_16758752
Residue:
381
  
Inhibitor
Name:
BDBM35408
Synonyms:
1-ethyl-4-keto-N-(4-methylcyclohexyl)-6-piperidinosulfonyl-quinoline-3-carboxamide 1-ethyl-N-(4-methylcyclohexyl)-4-oxo-6-(1-piperidinylsulfonyl)-3-quinolinecarboxamide 1-ethyl-N-(4-methylcyclohexyl)-4-oxo-6-piperidin-1-ylsulfonylquinoline-3-carboxamide SMR000030673 | cid_3243811
Type:
Small organic molecule
Emp. Form.:
C24H33N3O4S
Mol. Mass.:
459.602
SMILES:
CCn1cc(C(=O)NC2CCC(C)CC2)c(=O)c2cc(ccc12)S(=O)(=O)N1CCCCC1
: