Target
Dual specificity protein phosphatase 6
Ligand
BDBM35413
Substrate
Meas. Tech.
In vitro MKP-3 Phosphatase Dose Response Hit/Probe Assessment Assay
IC50
>50000±n/a nM
Citation
 PubChem, PC In vitro MKP-3 Phosphatase Dose Response Hit/Probe Assessment Assay PubChem Bioassay (2007)[AID] 
Target
Name:
Dual specificity protein phosphatase 6
Synonyms:
DUS6_RAT MAP kinase phosphatase 3 Mitogen-activated protein kinase phosphatase 3 | Mkp3
Type:
Enzyme
Mol. Mass.:
42303.19
Organism:
Rattus norvegicus
Description:
gi_16758752
Residue:
381
  
Inhibitor
Name:
BDBM35413
Synonyms:
6-[2-(4-chlorophenyl)-2-oxidanylidene-ethyl]sulfanyl-1-phenyl-2H-pyrazolo[3,4-d]pyrimidin-4-one 6-[[2-(4-chlorophenyl)-2-keto-ethyl]thio]-1-phenyl-2H-pyrazolo[3,4-d]pyrimidin-4-one MLS000091816 cid_1488927
Type:
Small organic molecule
Emp. Form.:
C19H13ClN4O2S
Mol. Mass.:
396.85
SMILES:
Clc1ccc(cc1)C(=O)CSc1nc2n(ncc2c(=O)[nH]1)-c1ccccc1
: