Target
Dual specificity protein phosphatase 6
Ligand
BDBM35419
Substrate
Meas. Tech.
In vitro MKP-3 Phosphatase Dose Response Hit/Probe Assessment Assay
IC50
>50000±n/a nM
Citation
 PubChem, PC In vitro MKP-3 Phosphatase Dose Response Hit/Probe Assessment Assay PubChem Bioassay (2007)[AID] 
Target
Name:
Dual specificity protein phosphatase 6
Synonyms:
DUS6_RAT MAP kinase phosphatase 3 Mitogen-activated protein kinase phosphatase 3 | Mkp3
Type:
Enzyme
Mol. Mass.:
42303.19
Organism:
Rattus norvegicus
Description:
gi_16758752
Residue:
381
  
Inhibitor
Name:
BDBM35419
Synonyms:
MLS000050867 N-(9-ethyl-9H-carbazol-3-yl)-2-{[4-ethyl-5-(2-furyl)-4H-1,2,4-triazol-3-yl]thio}acetamide N-(9-ethylcarbazol-3-yl)-2-[[4-ethyl-5-(furan-2-yl)-1,2,4-triazol-3-yl]sulfanyl]acetamide SMR000078562 | cid_1890961
Type:
Small organic molecule
Emp. Form.:
C24H23N5O2S
Mol. Mass.:
445.537
SMILES:
CCn1c(SCC(=O)Nc2ccc3n(CC)c4ccccc4c3c2)nnc1-c1ccco1
: