Target
Mevalonate kinase
Ligand
BDBM38573
Substrate
Meas. Tech.
Screening for Inhibitors of the Mevalonate Pathway in Streptococcus Pneumoniae - MK Dose Response
IC50
3397±n/a nM
Citation
 PubChem, PC Screening for Inhibitors of the Mevalonate Pathway in Streptococcus Pneumoniae - MK Dose Response PubChem Bioassay (2007)[AID] 
Target
Name:
Mevalonate kinase
Synonyms:
Type:
Enzyme Catalytic Domain
Mol. Mass.:
31420.64
Organism:
Streptococcus pneumoniae D39
Description:
A0A0H2ZQX9
Residue:
292
  
Inhibitor
Name:
BDBM38573
Synonyms:
9,10-dimethoxy-2-(2-pyridinylmethylamino)-6,7-dihydropyrimido[6,1-a]isoquinolin-4-one 9,10-dimethoxy-2-(pyridin-2-ylmethylamino)-6,7-dihydropyrimido[6,1-a]isoquinolin-4-one SMR000046352 | cid_665278
Type:
Small organic molecule
Emp. Form.:
C20H20N4O3
Mol. Mass.:
364.3978
SMILES:
COc1cc2CCn3c(cc(NCc4ccccn4)nc3=O)-c2cc1OC
: