Target
Mevalonate kinase
Ligand
BDBM38595
Substrate
Meas. Tech.
Screening for Inhibitors of the Mevalonate Pathway in Streptococcus Pneumoniae - MK Dose Response
IC50
15191.1±n/a nM
Citation
 PubChem, PC Screening for Inhibitors of the Mevalonate Pathway in Streptococcus Pneumoniae - MK Dose Response PubChem Bioassay (2007)[AID] 
Target
Name:
Mevalonate kinase
Synonyms:
Type:
Enzyme Catalytic Domain
Mol. Mass.:
31420.64
Organism:
Streptococcus pneumoniae D39
Description:
A0A0H2ZQX9
Residue:
292
  
Inhibitor
Name:
BDBM38595
Synonyms:
2-[(4-chloranylphenoxy)methyl]-3-methyl-quinazolin-4-one 2-[(4-chlorophenoxy)methyl]-3-methyl-quinazolin-4-one 2-[(4-chlorophenoxy)methyl]-3-methylquinazolin-4-one SMR000024125 | cid_583515
Type:
Small organic molecule
Emp. Form.:
C16H13ClN2O2
Mol. Mass.:
300.74
SMILES:
Cn1c(COc2ccc(Cl)cc2)nc2ccccc2c1=O
: