Target
Mevalonate kinase
Ligand
BDBM38601
Substrate
Meas. Tech.
Screening for Inhibitors of the Mevalonate Pathway in Streptococcus Pneumoniae - MK Dose Response
IC50
3614.4±n/a nM
Citation
 PubChem, PC Screening for Inhibitors of the Mevalonate Pathway in Streptococcus Pneumoniae - MK Dose Response PubChem Bioassay (2007)[AID] 
Target
Name:
Mevalonate kinase
Synonyms:
Type:
Enzyme Catalytic Domain
Mol. Mass.:
31420.64
Organism:
Streptococcus pneumoniae D39
Description:
A0A0H2ZQX9
Residue:
292
  
Inhibitor
Name:
BDBM38601
Synonyms:
7-(3,4-dimethylanilino)-6-(2-methylphenyl)-7H-pyrrolo[3,4-b]pyridin-5-one 7-[(3,4-dimethylphenyl)amino]-6-(2-methylphenyl)-6,7-dihydro-5H-pyrrolo[3,4-b]pyridin-5-one MLS000045804 cid_3240143
Type:
Small organic molecule
Emp. Form.:
C22H21N3O
Mol. Mass.:
343.4216
SMILES:
Cc1ccc(Nc2n(-c3ccccc3C)c(=O)c3ccc[nH]c23)cc1C
: