Target
Dual specificity protein phosphatase 1
Ligand
BDBM33046
Substrate
Meas. Tech.
In vitro MKP-1 Phosphatase Dose Response Active/Probe Assessment Assay - Effects of Catalase
IC50
19812±n/a nM
Citation
 PubChem, PC In vitro MKP-1 Phosphatase Dose Response Active/Probe Assessment Assay - Effects of Catalase PubChem Bioassay (2006)[AID] 
Target
Name:
Dual specificity protein phosphatase 1
Synonyms:
CL100 DUSP1 MAP kinase phosphatase 1 MKP1 Protein-tyrosine phosphatase CL100 | VH1
Type:
Protein phosphatase
Mol. Mass.:
39301.48
Organism:
Homo sapiens (Human)
Description:
gi_4758204
Residue:
367
  
Inhibitor
Name:
BDBM33046
Synonyms:
2-[(5-amino-1H-1,2,4-triazol-3-yl)sulfanyl]-N-[3-cyano-7,7-dimethyl-5-[(E)-2-(5-methylfuran-2-yl)ethenyl]-6H-1-benzothiophen-2-yl]acetamide 2-[(5-amino-1H-1,2,4-triazol-3-yl)thio]-N-[3-cyano-7,7-dimethyl-5-[(E)-2-(5-methyl-2-furyl)vinyl]-6H-benzothiophen-2-yl]acetamide MLS000097571 cid_2079240
Type:
Small organic molecule
Emp. Form.:
C22H22N6O2S2
Mol. Mass.:
466.579
SMILES:
Cc1ccc(\C=C\C2=Cc3c(sc(NC(=O)CSc4nnc(N)[nH]4)c3C#N)C(C)(C)C2)o1
: