Target
Dual specificity protein phosphatase 1
Ligand
BDBM35362
Substrate
Meas. Tech.
In vitro MKP-1 Phosphatase Dose Response Active/Probe Assessment Assay - Reproducibility testing
IC50
24359±n/a nM
Citation
 PubChem, PC In vitro MKP-1 Phosphatase Dose Response Active/Probe Assessment Assay - Reproducibility testing PubChem Bioassay (2006)[AID] 
Target
Name:
Dual specificity protein phosphatase 1
Synonyms:
CL100 DUSP1 MAP kinase phosphatase 1 MKP1 Protein-tyrosine phosphatase CL100 | VH1
Type:
Protein phosphatase
Mol. Mass.:
39301.48
Organism:
Homo sapiens (Human)
Description:
gi_4758204
Residue:
367
  
Inhibitor
Name:
BDBM35362
Synonyms:
5-bromanyl-N-(3-cyano-1-phenyl-pyrrolo[3,2-b]quinoxalin-2-yl)furan-2-carboxamide 5-bromo-N-(3-cyano-1-phenyl-pyrrolo[3,2-b]quinoxalin-2-yl)-2-furamide MLS000068756 cid_658921
Type:
Small organic molecule
Emp. Form.:
C22H12BrN5O2
Mol. Mass.:
458.267
SMILES:
Brc1ccc(o1)C(=O)Nc1c(C#N)c2nc3ccccc3nc2n1-c1ccccc1
: