Target
Dual specificity protein phosphatase 1
Ligand
BDBM35371
Substrate
Meas. Tech.
In vitro MKP-1 Phosphatase Dose Response Active/Probe Assessment Assay - Reproducibility testing
IC50
>50000±n/a nM
Citation
 PubChem, PC In vitro MKP-1 Phosphatase Dose Response Active/Probe Assessment Assay - Reproducibility testing PubChem Bioassay (2006)[AID] 
Target
Name:
Dual specificity protein phosphatase 1
Synonyms:
CL100 DUSP1 MAP kinase phosphatase 1 MKP1 Protein-tyrosine phosphatase CL100 | VH1
Type:
Protein phosphatase
Mol. Mass.:
39301.48
Organism:
Homo sapiens (Human)
Description:
gi_4758204
Residue:
367
  
Inhibitor
Name:
BDBM35371
Synonyms:
(7-chloro-5-pyrrolidino-benzofurazan-4-yl)amine 7-chloro-5-(1-pyrrolidinyl)-2,1,3-benzoxadiazol-4-amine MLS000042514 cid_667215
Type:
Small organic molecule
Emp. Form.:
C10H11ClN4O
Mol. Mass.:
238.674
SMILES:
Nc1c(cc(Cl)c2nonc12)N1CCCC1
: