Target
Dual specificity protein phosphatase 6
Ligand
BDBM30768
Substrate
Meas. Tech.
In vitro MKP-3 Phosphatase Dose Response Active/Probe Assessment Assay - Effects of Catalase
IC50
>50000±n/a nM
Citation
 PubChem, PC In vitro MKP-3 Phosphatase Dose Response Active/Probe Assessment Assay - Effects of Catalase PubChem Bioassay (2006)[AID] 
Target
Name:
Dual specificity protein phosphatase 6
Synonyms:
DUS6_RAT MAP kinase phosphatase 3 Mitogen-activated protein kinase phosphatase 3 | Mkp3
Type:
Enzyme
Mol. Mass.:
42303.19
Organism:
Rattus norvegicus
Description:
gi_16758752
Residue:
381
  
Inhibitor
Name:
BDBM30768
Synonyms:
2-amino-1-(3-methoxypropyl)-N-(3-methylbutyl)-3-pyrrolo[3,2-b]quinoxalinecarboxamide 2-amino-N-isoamyl-1-(3-methoxypropyl)pyrrolo[3,2-b]quinoxaline-3-carboxamide MLS000041744 US9073941, 1012 | cid_663108
Type:
Small organic molecule
Emp. Form.:
C20H27N5O2
Mol. Mass.:
369.4607
SMILES:
COCCCn1c(N)c(C(=O)NCCC(C)C)c2nc3ccccc3nc12
: