Target
Dual specificity protein phosphatase 6
Ligand
BDBM35400
Substrate
Meas. Tech.
In vitro MKP-3 Phosphatase Dose Response Active/Probe Assessment Assay - Effects of Catalase
IC50
>50000±n/a nM
Citation
 PubChem, PC In vitro MKP-3 Phosphatase Dose Response Active/Probe Assessment Assay - Effects of Catalase PubChem Bioassay (2006)[AID] 
Target
Name:
Dual specificity protein phosphatase 6
Synonyms:
DUS6_RAT MAP kinase phosphatase 3 Mitogen-activated protein kinase phosphatase 3 | Mkp3
Type:
Enzyme
Mol. Mass.:
42303.19
Organism:
Rattus norvegicus
Description:
gi_16758752
Residue:
381
  
Inhibitor
Name:
BDBM35400
Synonyms:
3-amino-N-(5-propylsulfanyl-1,3,4-thiadiazol-2-yl)-6-thiophen-2-ylthieno[2,3-b]pyridine-2-carboxamide 3-amino-N-[5-(propylthio)-1,3,4-thiadiazol-2-yl]-6-thien-2-ylthieno[2,3-b]pyridine-2-carboxamide 3-azanyl-N-(5-propylsulfanyl-1,3,4-thiadiazol-2-yl)-6-thiophen-2-yl-thieno[2,3-b]pyridine-2-carboxamide SMR000019719 | cid_1773030
Type:
Small organic molecule
Emp. Form.:
C17H15N5OS4
Mol. Mass.:
433.594
SMILES:
CCCSc1nnc(NC(=O)c2sc3nc(ccc3c2N)-c2cccs2)s1
: