Target
Dual specificity protein phosphatase 6
Ligand
BDBM35368
Substrate
Meas. Tech.
In vitro MKP-3 Phosphatase Dose Response Active/Probe Assessment Assay - Reproducibility testing
IC50
>50000±n/a nM
Citation
 PubChem, PC In vitro MKP-3 Phosphatase Dose Response Active/Probe Assessment Assay - Reproducibility testing PubChem Bioassay (2007)[AID] 
Target
Name:
Dual specificity protein phosphatase 6
Synonyms:
DUS6_RAT MAP kinase phosphatase 3 Mitogen-activated protein kinase phosphatase 3 | Mkp3
Type:
Enzyme
Mol. Mass.:
42303.19
Organism:
Rattus norvegicus
Description:
gi_16758752
Residue:
381
  
Inhibitor
Name:
BDBM35368
Synonyms:
2-amino-N-butyl-1-(3-methoxypropyl)-3-pyrrolo[3,2-b]quinoxalinecarboxamide 2-azanyl-N-butyl-1-(3-methoxypropyl)pyrrolo[3,2-b]quinoxaline-3-carboxamide SMR000043612 | cid_662864
Type:
Small organic molecule
Emp. Form.:
C19H25N5O2
Mol. Mass.:
355.4341
SMILES:
CCCCNC(=O)c1c(N)n(CCCOC)c2nc3ccccc3nc12
: