Target
Dual specificity protein phosphatase 6
Ligand
BDBM35403
Substrate
Meas. Tech.
In vitro MKP-3 Phosphatase Dose Response Active/Probe Assessment Assay - Reproducibility testing
IC50
>50000±n/a nM
Citation
 PubChem, PC In vitro MKP-3 Phosphatase Dose Response Active/Probe Assessment Assay - Reproducibility testing PubChem Bioassay (2007)[AID] 
Target
Name:
Dual specificity protein phosphatase 6
Synonyms:
DUS6_RAT MAP kinase phosphatase 3 Mitogen-activated protein kinase phosphatase 3 | Mkp3
Type:
Enzyme
Mol. Mass.:
42303.19
Organism:
Rattus norvegicus
Description:
gi_16758752
Residue:
381
  
Inhibitor
Name:
BDBM35403
Synonyms:
MLS000094302 cid_3242856 | methyl 2-{[(3-chloro-6-oxo-6a,7,8,9-tetrahydropyrido[3,2-e]pyrrolo[1,2-a]pyrazin-5(6H)-yl)acetyl]amino}benzoate
Type:
Small organic molecule
Emp. Form.:
C20H19ClN4O4
Mol. Mass.:
414.842
SMILES:
COC(=O)c1ccccc1NC(=O)CN1C(=O)C2CCCN2c2ncc(Cl)cc12
: