Target
M-phase inducer phosphatase 2
Ligand
BDBM38824
Substrate
Meas. Tech.
Cdc25B Catalytic Domain Protein Tyrosine Phosphatase HTS Dose Response Confirmation Assay
IC50
>50000±n/a nM
Citation
 PubChem, PC Cdc25B Catalytic Domain Protein Tyrosine Phosphatase HTS Dose Response Confirmation Assay PubChem Bioassay (2006)[AID] 
Target
Name:
M-phase inducer phosphatase 2
Synonyms:
CDC25B Dual specificity phosphatase (CDC25B) M-phase inducer phosphatase 2 (CDC25B) | MPIP2_HUMAN
Type:
Protein
Mol. Mass.:
64985.27
Organism:
Homo sapiens (Human)
Description:
Residue:
580
  
Inhibitor
Name:
BDBM38824
Synonyms:
1-(4-methoxybenzyl)-N-(3-morpholin-4-ylpropyl)-5-oxopyrrolidine-3-carboxamide 1-[(4-methoxyphenyl)methyl]-N-(3-morpholin-4-ylpropyl)-5-oxopyrrolidine-3-carboxamide 5-keto-N-(3-morpholinopropyl)-1-p-anisyl-pyrrolidine-3-carboxamide SMR000032465 | cid_3242857
Type:
Small organic molecule
Emp. Form.:
C20H29N3O4
Mol. Mass.:
375.462
SMILES:
COc1ccc(CN2CC(CC2=O)C(=O)NCCCN2CCOCC2)cc1
: