Target
Steroidogenic factor 1
Ligand
BDBM39001
Substrate
Meas. Tech.
Dose-response cell-based assay for inhibitors of the nuclear receptor Steroidogenic Factor 1 (SF-1)
IC50
511±n/a nM
Citation
 PubChem, PC Dose-response cell-based assay for inhibitors of the nuclear receptor Steroidogenic Factor 1 (SF-1) PubChem Bioassay (2007)[AID] 
Target
Name:
Steroidogenic factor 1
Synonyms:
AD4BP FTZF1 NR5A1 SF-1 STF-1 Steroid hormone receptor Ad4BP
Type:
Nuclear Hormone Receptor
Mol. Mass.:
51643.43
Organism:
Homo sapiens (Human)
Description:
Residue:
461
  
Inhibitor
Name:
BDBM39001
Synonyms:
3-[(4-ethoxyphenoxy)methyl]benzoic acid SMR000072768 | cid_891145
Type:
Small organic molecule
Emp. Form.:
C16H16O4
Mol. Mass.:
272.2958
SMILES:
CCOc1ccc(OCc2cccc(c2)C(O)=O)cc1
: