Target
Steroidogenic factor 1
Ligand
BDBM31347
Substrate
Meas. Tech.
Dose-response cell-based assay for inhibitors of the nuclear receptor Steroidogenic Factor 1 (SF-1)
IC50
>3667±n/a nM
Citation
 PubChem, PC Dose-response cell-based assay for inhibitors of the nuclear receptor Steroidogenic Factor 1 (SF-1) PubChem Bioassay (2007)[AID] 
Target
Name:
Steroidogenic factor 1
Synonyms:
AD4BP FTZF1 NR5A1 SF-1 STF-1 Steroid hormone receptor Ad4BP
Type:
Nuclear Hormone Receptor
Mol. Mass.:
51643.43
Organism:
Homo sapiens (Human)
Description:
Residue:
461
  
Inhibitor
Name:
BDBM31347
Synonyms:
2-(3,4-dimethoxyphenyl)-N-[3-[5-(3-methylphenyl)-1,3,4-oxadiazol-2-yl]phenyl]acetamide 2-(3,4-dimethoxyphenyl)-N-[3-[5-(m-tolyl)-1,3,4-oxadiazol-2-yl]phenyl]acetamide MLS000052465 cid_2233014
Type:
Small organic molecule
Emp. Form.:
C25H23N3O4
Mol. Mass.:
429.4678
SMILES:
COc1ccc(CC(=O)Nc2cccc(c2)-c2nnc(o2)-c2cccc(C)c2)cc1OC
: