Target
Isoform 2 of Nuclear receptor ROR-alpha (Alpha-2)
Ligand
BDBM38856
Substrate
Meas. Tech.
Dose-response cell-based assay for inhibitors of the Retinoic Acid Receptor-related orphan receptor A (RORA)
IC50
656±n/a nM
Citation
 PubChem, PC Dose-response cell-based assay for inhibitors of the Retinoic Acid Receptor-related orphan receptor A (RORA) PubChem Bioassay (2007)[AID] 
Target
Name:
Isoform 2 of Nuclear receptor ROR-alpha (Alpha-2)
Synonyms:
NR1F1 Nuclear receptor ROR-alpha (Alpha-2) RORA RZRA
Type:
PROTEIN
Mol. Mass.:
63033.59
Organism:
Homo sapiens (Human)
Description:
EBI_101591
Residue:
556
  
Inhibitor
Name:
BDBM38856
Synonyms:
2,6-Dimethyl-benzo[1,2-b;4,5-b']difuran-3,7-dicarboxylic acid bis-(2-dimethylamino-ethyl) ester MLS000033569 bis[2-(dimethylamino)ethyl] 2,6-dimethylfuro[2,3-f][1]benzofuran-3,7-dicarboxylate | cid_650137
Type:
Small organic molecule
Emp. Form.:
C22H28N2O6
Mol. Mass.:
416.4675
SMILES:
CN(C)CCOC(=O)c1c(C)oc2cc3c(C(=O)OCCN(C)C)c(C)oc3cc12
: