Target
Isoform 2 of Nuclear receptor ROR-alpha (Alpha-2)
Ligand
BDBM31064
Substrate
Meas. Tech.
Dose-response cell-based assay for inhibitors of the Retinoic Acid Receptor-related orphan receptor A (RORA)
IC50
6980±n/a nM
Citation
 PubChem, PC Dose-response cell-based assay for inhibitors of the Retinoic Acid Receptor-related orphan receptor A (RORA) PubChem Bioassay (2007)[AID] 
Target
Name:
Isoform 2 of Nuclear receptor ROR-alpha (Alpha-2)
Synonyms:
NR1F1 Nuclear receptor ROR-alpha (Alpha-2) RORA RZRA
Type:
PROTEIN
Mol. Mass.:
63033.59
Organism:
Homo sapiens (Human)
Description:
EBI_101591
Residue:
556
  
Inhibitor
Name:
BDBM31064
Synonyms:
4-(2-furanyl)-2-methylsulfonyl-6-(trifluoromethyl)pyrimidine 4-(2-furyl)-2-mesyl-6-(trifluoromethyl)pyrimidine MLS000044646 cid_3237865
Type:
Small organic molecule
Emp. Form.:
C10H7F3N2O3S
Mol. Mass.:
292.234
SMILES:
CS(=O)(=O)c1nc(cc(n1)C(F)(F)F)-c1ccco1
: