Target
Isoform 2 of Nuclear receptor ROR-alpha (Alpha-2)
Ligand
BDBM39039
Substrate
Meas. Tech.
Dose-response cell-based assay for inhibitors of the Retinoic Acid Receptor-related orphan receptor A (RORA)
IC50
570±n/a nM
Citation
 PubChem, PC Dose-response cell-based assay for inhibitors of the Retinoic Acid Receptor-related orphan receptor A (RORA) PubChem Bioassay (2007)[AID] 
Target
Name:
Isoform 2 of Nuclear receptor ROR-alpha (Alpha-2)
Synonyms:
NR1F1 Nuclear receptor ROR-alpha (Alpha-2) RORA RZRA
Type:
PROTEIN
Mol. Mass.:
63033.59
Organism:
Homo sapiens (Human)
Description:
EBI_101591
Residue:
556
  
Inhibitor
Name:
BDBM39039
Synonyms:
3-[2-(3,5-dimethoxyphenyl)-5,7-dimethyl-6-pyrazolo[1,5-a]pyrimidinyl]propanoic acid 3-[2-(3,5-dimethoxyphenyl)-5,7-dimethyl-pyrazolo[1,5-a]pyrimidin-6-yl]propionic acid MLS000120704 cid_5307346
Type:
Small organic molecule
Emp. Form.:
C19H21N3O4
Mol. Mass.:
355.3877
SMILES:
COc1cc(OC)cc(c1)-c1cc2nc(C)c(CCC(O)=O)c(C)n2n1
: