Target
Bcl-2-related protein A1
Ligand
BDBM39143
Substrate
Meas. Tech.
TR-FRET secondary assay for HTS discovery of chemical inhibitors of anti-apoptotic protein Bfl-1
IC50
1450±110 nM
Citation
 PubChem, PC TR-FRET secondary assay for HTS discovery of chemical inhibitors of anti-apoptotic protein Bfl-1 PubChem Bioassay (2008)[AID] 
Target
Name:
Bcl-2-related protein A1
Synonyms:
A1 B-cell leukemia/lymphoma 2 related protein A1a Bcl2a1 Bfl-1 Hemopoietic-specific early response protein | Protein BFL-1
Type:
Apoptosis regulator protein
Mol. Mass.:
19909.74
Organism:
Mus musculus (Mouse)
Description:
gi_11024684
Residue:
172
  
Inhibitor
Name:
BDBM39143
Synonyms:
3-chloranyl-1-(2-chlorophenyl)-4-(4-methylpiperazin-1-yl)pyrrole-2,5-dione 3-chloro-1-(2-chlorophenyl)-4-(4-methyl-1-piperazinyl)pyrrole-2,5-dione 3-chloro-1-(2-chlorophenyl)-4-(4-methylpiperazino)-3-pyrroline-2,5-quinone MLS-0090833.0001 | cid_16654640
Type:
Small organic molecule
Emp. Form.:
C15H15Cl2N3O2
Mol. Mass.:
340.205
SMILES:
CN1CCN(CC1)C1=C(Cl)C(=O)N(C1=O)c1ccccc1Cl
: