Target
Bcl-2-related protein A1
Ligand
BDBM39172
Substrate
Meas. Tech.
TR-FRET secondary assay for HTS discovery of chemical inhibitors of anti-apoptotic protein Bfl-1
IC50
830±130 nM
Citation
 PubChem, PC TR-FRET secondary assay for HTS discovery of chemical inhibitors of anti-apoptotic protein Bfl-1 PubChem Bioassay (2008)[AID] 
Target
Name:
Bcl-2-related protein A1
Synonyms:
A1 B-cell leukemia/lymphoma 2 related protein A1a Bcl2a1 Bfl-1 Hemopoietic-specific early response protein | Protein BFL-1
Type:
Apoptosis regulator protein
Mol. Mass.:
19909.74
Organism:
Mus musculus (Mouse)
Description:
gi_11024684
Residue:
172
  
Inhibitor
Name:
BDBM39172
Synonyms:
3-chloranyl-4-(4-ethylpiperazin-1-yl)-1-(4-nitrophenyl)pyrrole-2,5-dione 3-chloro-4-(4-ethylpiperazin-1-yl)-1-(4-nitrophenyl)pyrrole-2,5-dione MLS-0111725.0001 | cid_16654754
Type:
Small organic molecule
Emp. Form.:
C16H17ClN4O4
Mol. Mass.:
364.784
SMILES:
CCN1CCN(CC1)C1=C(Cl)C(=O)N(C1=O)c1ccc(cc1)[N+]([O-])=O
: