Target
Bcl-2-related protein A1
Ligand
BDBM39177
Substrate
Meas. Tech.
TR-FRET secondary assay for HTS discovery of chemical inhibitors of anti-apoptotic protein Bfl-1
IC50
9030±1060 nM
Citation
 PubChem, PC TR-FRET secondary assay for HTS discovery of chemical inhibitors of anti-apoptotic protein Bfl-1 PubChem Bioassay (2008)[AID] 
Target
Name:
Bcl-2-related protein A1
Synonyms:
A1 B-cell leukemia/lymphoma 2 related protein A1a Bcl2a1 Bfl-1 Hemopoietic-specific early response protein | Protein BFL-1
Type:
Apoptosis regulator protein
Mol. Mass.:
19909.74
Organism:
Mus musculus (Mouse)
Description:
gi_11024684
Residue:
172
  
Inhibitor
Name:
BDBM39177
Synonyms:
3-chloranyl-4-[(3R)-3-methylpiperazin-1-yl]-1-(3-nitrophenyl)pyrrole-2,5-dione 3-chloro-4-[(3R)-3-methylpiperazin-1-yl]-1-(3-nitrophenyl)pyrrole-2,5-dione MLS-0111747.0001 | cid_16654774
Type:
Small organic molecule
Emp. Form.:
C15H15ClN4O4
Mol. Mass.:
350.757
SMILES:
C[C@@H]1CN(CCN1)C1=C(Cl)C(=O)N(C1=O)c1cccc(c1)[N+]([O-])=O
: