Target
Rho-associated protein kinase 2
Ligand
BDBM37913
Substrate
Meas. Tech.
Dose-response biochemical assay of inhibitors of Rho kinase 2 (Rock2)
IC50
1132±n/a nM
Citation
 PubChem, PC Dose-response biochemical assay of inhibitors of Rho kinase 2 (Rock2)  PubChem Bioassay (2007)[AID] 
Target
Name:
Rho-associated protein kinase 2
Synonyms:
KIAA0619 ROCK2 Rho kinase 2 (ROCKII) Rho-associated protein kinase 2 (ROCK2) Rho-associated protein kinase 2/Transforming protein RhoA Rho-associated, coiled-coil-containing protein kinase II p164 ROCK-2
Type:
Protein
Mol. Mass.:
160885.43
Organism:
Homo sapiens (Human)
Description:
O75116
Residue:
1388
  
Inhibitor
Name:
BDBM37913
Synonyms:
MLS000065710 N-(5-pyridin-4-yl-1,3,4-thiadiazol-2-yl)-2-thiophen-2-ylacetamide N-[5-(4-pyridyl)-1,3,4-thiadiazol-2-yl]-2-(2-thienyl)acetamide cid_1245524
Type:
Small organic molecule
Emp. Form.:
C13H10N4OS2
Mol. Mass.:
302.375
SMILES:
O=C(Cc1cccs1)Nc1nnc(s1)-c1ccncc1
: