Target
Rho-associated protein kinase 2
Ligand
BDBM39284
Substrate
Meas. Tech.
Dose-response biochemical assay of inhibitors of Rho kinase 2 (Rock2)
IC50
2314±n/a nM
Citation
 PubChem, PC Dose-response biochemical assay of inhibitors of Rho kinase 2 (Rock2)  PubChem Bioassay (2007)[AID] 
Target
Name:
Rho-associated protein kinase 2
Synonyms:
KIAA0619 ROCK2 Rho kinase 2 (ROCKII) Rho-associated protein kinase 2 (ROCK2) Rho-associated protein kinase 2/Transforming protein RhoA Rho-associated, coiled-coil-containing protein kinase II p164 ROCK-2
Type:
Protein
Mol. Mass.:
160885.43
Organism:
Homo sapiens (Human)
Description:
O75116
Residue:
1388
  
Inhibitor
Name:
BDBM39284
Synonyms:
3-pyridyl-[4-(4-pyridyl)thiazol-2-yl]amine N-(3-pyridinyl)-4-pyridin-4-yl-2-thiazolamine N-pyridin-3-yl-4-pyridin-4-yl-1,3-thiazol-2-amine cid_973172
Type:
Small organic molecule
Emp. Form.:
C13H10N4S
Mol. Mass.:
254.31
SMILES:
N(c1nc(cs1)-c1ccncc1)c1cccnc1
: