Target
Rho-associated protein kinase 2
Ligand
BDBM39302
Substrate
Meas. Tech.
Dose-response biochemical assay of inhibitors of Rho kinase 2 (Rock2)
IC50
21370±n/a nM
Citation
 PubChem, PC Dose-response biochemical assay of inhibitors of Rho kinase 2 (Rock2)  PubChem Bioassay (2007)[AID] 
Target
Name:
Rho-associated protein kinase 2
Synonyms:
KIAA0619 ROCK2 Rho kinase 2 (ROCKII) Rho-associated protein kinase 2 (ROCK2) Rho-associated protein kinase 2/Transforming protein RhoA Rho-associated, coiled-coil-containing protein kinase II p164 ROCK-2
Type:
Protein
Mol. Mass.:
160885.43
Organism:
Homo sapiens (Human)
Description:
O75116
Residue:
1388
  
Inhibitor
Name:
BDBM39302
Synonyms:
CHEMBL228792 N-(2-furanylmethyl)-7H-purin-6-amine N-(furan-2-ylmethyl)-9H-purin-6-amine cid_3830 | kinetin
Type:
Small organic molecule
Emp. Form.:
C10H9N5O
Mol. Mass.:
215.2114
SMILES:
C(Nc1ncnc2nc[nH]c12)c1ccco1
: