Target
Genome polyprotein
Ligand
BDBM31997
Substrate
Meas. Tech.
West Nile Virus NS2bNS3 Proteinase Inhibitor Dose Response Confirmation.
IC50
10068±n/a nM
Citation
 PubChem, PC West Nile Virus NS2bNS3 Proteinase Inhibitor Dose Response Confirmation. PubChem Bioassay (2007)[AID] 
Target
Name:
Genome polyprotein
Synonyms:
POLG_WNV | polyprotein precursor
Type:
PROTEIN
Mol. Mass.:
380170.63
Organism:
West Nile virus
Description:
ChEMBL_1438217
Residue:
3430
  
Inhibitor
Name:
BDBM31997
Synonyms:
6-Methoxy-3-methyl-1H-benzo[de]cinnoline SMR000010302 | cid_644992
Type:
Small organic molecule
Emp. Form.:
C13H12N2O
Mol. Mass.:
212.2472
SMILES:
COc1ccc2c(C)n[nH]c3cccc1c23
: