Target
Genome polyprotein
Ligand
BDBM39377
Substrate
Meas. Tech.
West Nile Virus NS2bNS3 Proteinase Inhibitor Dose Response Confirmation.
IC50
50000±n/a nM
Citation
 PubChem, PC West Nile Virus NS2bNS3 Proteinase Inhibitor Dose Response Confirmation. PubChem Bioassay (2007)[AID] 
Target
Name:
Genome polyprotein
Synonyms:
POLG_WNV | polyprotein precursor
Type:
PROTEIN
Mol. Mass.:
380170.63
Organism:
West Nile virus
Description:
ChEMBL_1438217
Residue:
3430
  
Inhibitor
Name:
BDBM39377
Synonyms:
(2-oxidanylideneoxolan-3-yl) 3-methyl-1-phenyl-thieno[2,3-c]pyrazole-5-carboxylate 3-methyl-1-phenyl-5-thieno[2,3-c]pyrazolecarboxylic acid (2-oxo-3-oxolanyl) ester MLS000054627 cid_2997891
Type:
Small organic molecule
Emp. Form.:
C17H14N2O4S
Mol. Mass.:
342.369
SMILES:
Cc1nn(-c2ccccc2)c2sc(cc12)C(=O)OC1CCOC1=O
: