Target
Genome polyprotein
Ligand
BDBM39383
Substrate
Meas. Tech.
West Nile Virus NS2bNS3 Proteinase Inhibitor Dose Response Confirmation.
IC50
50000±n/a nM
Citation
 PubChem, PC West Nile Virus NS2bNS3 Proteinase Inhibitor Dose Response Confirmation. PubChem Bioassay (2007)[AID] 
Target
Name:
Genome polyprotein
Synonyms:
POLG_WNV | polyprotein precursor
Type:
PROTEIN
Mol. Mass.:
380170.63
Organism:
West Nile virus
Description:
ChEMBL_1438217
Residue:
3430
  
Inhibitor
Name:
BDBM39383
Synonyms:
5-[[[5-[(5-carbomethoxy-2-furyl)methylthio]-1,3,4-thiadiazol-2-yl]thio]methyl]furan-2-carboxylic acid methyl ester MLS000048401 cid_2513588 | methyl 5-[[5-[(5-methoxycarbonylfuran-2-yl)methylsulfanyl]-1,3,4-thiadiazol-2-yl]sulfanylmethyl]furan-2-carboxylate
Type:
Small organic molecule
Emp. Form.:
C16H14N2O6S3
Mol. Mass.:
426.487
SMILES:
COC(=O)c1ccc(CSc2nnc(SCc3ccc(o3)C(=O)OC)s2)o1
: