Target
Genome polyprotein
Ligand
BDBM35509
Substrate
Meas. Tech.
West Nile Virus NS2bNS3 Proteinase Inhibitor Dose Response Confirmation.
IC50
110±n/a nM
Citation
 PubChem, PC West Nile Virus NS2bNS3 Proteinase Inhibitor Dose Response Confirmation. PubChem Bioassay (2007)[AID] 
Target
Name:
Genome polyprotein
Synonyms:
POLG_WNV | polyprotein precursor
Type:
PROTEIN
Mol. Mass.:
380170.63
Organism:
West Nile virus
Description:
ChEMBL_1438217
Residue:
3430
  
Inhibitor
Name:
BDBM35509
Synonyms:
2-thiophenecarboxylic acid [5-amino-1-(4-methoxyphenyl)sulfonyl-3-pyrazolyl] ester 5-amino-1-[(4-methoxyphenyl)sulfonyl]-1H-pyrazol-3-yl thiophene-2-carboxylate MLS000086044 [5-amino-1-(4-methoxyphenyl)sulfonylpyrazol-3-yl] thiophene-2-carboxylate cid_3240114 | thiophene-2-carboxylic acid [5-amino-1-(4-methoxyphenyl)sulfonyl-pyrazol-3-yl] ester
Type:
Small organic molecule
Emp. Form.:
C15H13N3O5S2
Mol. Mass.:
379.411
SMILES:
COc1ccc(cc1)S(=O)(=O)n1nc(OC(=O)c2cccs2)cc1N
: