Target
Sphingosine 1-phosphate receptor 1
Ligand
BDBM264699
Substrate
Meas. Tech.
BCA Protein Assay
pH
7.4±n/a
Temperature
298.15±n/a K
IC50
0.800±n/a nM
Comments
extracted
Citation
 Inoue, HOhno, KNakamura, TOhsawa, Y Aniline derivative, pharmaceutical composition containing same, and use thereof US Patent  US9718771 Publication Date 8/1/2017 
Target
Name:
Sphingosine 1-phosphate receptor 1
Synonyms:
CHEDG1 Endothelial differentiation G-protein coupled receptor 1 S1P1 S1PR1_HUMAN Sphingosine 1-phosphate receptor Edg-1
Type:
Enzyme
Mol. Mass.:
42836.02
Organism:
Homo sapiens (Human)
Description:
P21453
Residue:
382
  
Inhibitor
Name:
BDBM264699
Synonyms:
US9718771, 2-45
Type:
Small organic molecule
Emp. Form.:
C24H28ClF3N2O2
Mol. Mass.:
468.94
SMILES:
CCC(N(CC)c1ccc(Cl)c(c1)C(F)(F)F)c1ccc(C)c(CN2CC(C2)C(O)=O)c1
: