Target
Isoform 2 of Nuclear receptor ROR-alpha (Alpha-2)
Ligand
BDBM39476
Substrate
Meas. Tech.
Counterscreen for activators of the nuclear receptor Steroidogenic Factor 1 (SF-1): A cell-based dose-response assay for inhibition of the RAR-related orphan receptor A (RORA)
EC50
1715±n/a nM
Citation
 PubChem, PC Counterscreen for activators of the nuclear receptor Steroidogenic Factor 1 (SF-1): A cell-based dose-response assay for inhibition of the RAR-related orphan receptor A (RORA) PubChem Bioassay (2007)[AID] 
Target
Name:
Isoform 2 of Nuclear receptor ROR-alpha (Alpha-2)
Synonyms:
NR1F1 Nuclear receptor ROR-alpha (Alpha-2) RORA RZRA
Type:
PROTEIN
Mol. Mass.:
63033.59
Organism:
Homo sapiens (Human)
Description:
EBI_101591
Residue:
556
  
Inhibitor
Name:
BDBM39476
Synonyms:
1-[[5-(1,3-benzothiazol-2-yl)-2-thienyl]sulfonyl]isonipecotic acid ethyl ester MLS000047208 cid_3241379 ethyl 1-{[5-(1,3-benzothiazol-2-yl)thien-2-yl]sulfonyl}piperidine-4-carboxylate
Type:
Small organic molecule
Emp. Form.:
C19H20N2O4S3
Mol. Mass.:
436.568
SMILES:
CCOC(=O)C1CCN(CC1)S(=O)(=O)c1ccc(s1)-c1nc2ccccc2s1
: