Target
M-phase inducer phosphatase 2
Ligand
BDBM35419
Substrate
Meas. Tech.
MKP-1 Dual Specificity Protein Tyrosine Phosphatase Probe Assessment: Cdc25B Dose Response Selectivity Assay
IC50
46077±n/a nM
Citation
 PubChem, PC MKP-1 Dual Specificity Protein Tyrosine Phosphatase Probe Assessment: Cdc25B Dose Response Selectivity Assay PubChem Bioassay (2007)[AID] 
Target
Name:
M-phase inducer phosphatase 2
Synonyms:
CDC25B Dual specificity phosphatase (CDC25B) M-phase inducer phosphatase 2 (CDC25B) | MPIP2_HUMAN
Type:
Protein
Mol. Mass.:
64985.27
Organism:
Homo sapiens (Human)
Description:
Residue:
580
  
Inhibitor
Name:
BDBM35419
Synonyms:
MLS000050867 N-(9-ethyl-9H-carbazol-3-yl)-2-{[4-ethyl-5-(2-furyl)-4H-1,2,4-triazol-3-yl]thio}acetamide N-(9-ethylcarbazol-3-yl)-2-[[4-ethyl-5-(furan-2-yl)-1,2,4-triazol-3-yl]sulfanyl]acetamide SMR000078562 | cid_1890961
Type:
Small organic molecule
Emp. Form.:
C24H23N5O2S
Mol. Mass.:
445.537
SMILES:
CCn1c(SCC(=O)Nc2ccc3n(CC)c4ccccc4c3c2)nnc1-c1ccco1
: