Target
Coagulation factor XI
Ligand
BDBM32676
Substrate
Meas. Tech.
Factor XIa Dose Response Confirmation
IC50
4010.23±890.638 nM
Citation
 PubChem, PC Factor XIa Dose Response Confirmation PubChem Bioassay (2008)[AID] 
Target
Name:
Coagulation factor XI
Synonyms:
Coagulation factor XIa Coagulation factor XIa light chain FA11_HUMAN Factor XIa PTA | Plasma thromboplastin antecedent
Type:
Enzyme
Mol. Mass.:
70130.58
Organism:
Homo sapiens (Human)
Description:
P03951
Residue:
625
  
Inhibitor
Name:
BDBM32676
Synonyms:
(3-amino-1,2,4-triazol-4-yl)-(3,5-dimethylphenyl)methanone 4-(3,5-dimethylbenzoyl)-4H-1,2,4-triazol-3-amine SMR000075231 | cid_912604
Type:
Small organic molecule
Emp. Form.:
C11H12N4O
Mol. Mass.:
216.2392
SMILES:
Cc1cc(C)cc(c1)C(=O)n1cnnc1N
: