Target
Coagulation factor XI
Ligand
BDBM32710
Substrate
Meas. Tech.
Factor XIa Dose Response Confirmation
IC50
>50000±0 nM
Citation
 PubChem, PC Factor XIa Dose Response Confirmation PubChem Bioassay (2008)[AID] 
Target
Name:
Coagulation factor XI
Synonyms:
Coagulation factor XIa Coagulation factor XIa light chain FA11_HUMAN Factor XIa PTA | Plasma thromboplastin antecedent
Type:
Enzyme
Mol. Mass.:
70130.58
Organism:
Homo sapiens (Human)
Description:
P03951
Residue:
625
  
Inhibitor
Name:
BDBM32710
Synonyms:
2-(4-methoxyphenyl)-N-piperonyl-acetamide N-(1,3-benzodioxol-5-ylmethyl)-2-(4-methoxyphenyl)acetamide SMR000141043 | cid_754514
Type:
Small organic molecule
Emp. Form.:
C17H17NO4
Mol. Mass.:
299.3212
SMILES:
COc1ccc(CC(=O)NCc2ccc3OCOc3c2)cc1
: