Target
Isoform 2 of Nuclear receptor ROR-alpha (Alpha-2)
Ligand
BDBM39540
Substrate
Meas. Tech.
Dose-response cell-based assay for activators of the Retinoic Acid Receptor-related orphan receptor A (RORA)
EC50
3629±n/a nM
Citation
 PubChem, PC Dose-response cell-based assay for activators of the Retinoic Acid Receptor-related orphan receptor A (RORA) PubChem Bioassay (2007)[AID] 
Target
Name:
Isoform 2 of Nuclear receptor ROR-alpha (Alpha-2)
Synonyms:
NR1F1 Nuclear receptor ROR-alpha (Alpha-2) RORA RZRA
Type:
PROTEIN
Mol. Mass.:
63033.59
Organism:
Homo sapiens (Human)
Description:
EBI_101591
Residue:
556
  
Inhibitor
Name:
BDBM39540
Synonyms:
5-(4-fluorobenzyl)oxycoumaran-3-one 5-[(4-fluorophenyl)methoxy]-3-benzofuranone SMR000036895 | cid_664461
Type:
Small organic molecule
Emp. Form.:
C15H11FO3
Mol. Mass.:
258.2444
SMILES:
Oc1coc2ccc(OCc3ccc(F)cc3)cc12
: