Target
Isoform 2 of Nuclear receptor ROR-alpha (Alpha-2)
Ligand
BDBM39547
Substrate
Meas. Tech.
Dose-response cell-based assay for activators of the Retinoic Acid Receptor-related orphan receptor A (RORA)
EC50
2637±n/a nM
Citation
 PubChem, PC Dose-response cell-based assay for activators of the Retinoic Acid Receptor-related orphan receptor A (RORA) PubChem Bioassay (2007)[AID] 
Target
Name:
Isoform 2 of Nuclear receptor ROR-alpha (Alpha-2)
Synonyms:
NR1F1 Nuclear receptor ROR-alpha (Alpha-2) RORA RZRA
Type:
PROTEIN
Mol. Mass.:
63033.59
Organism:
Homo sapiens (Human)
Description:
EBI_101591
Residue:
556
  
Inhibitor
Name:
BDBM39547
Synonyms:
5-chloranyl-N-(2,5-diethoxy-4-morpholin-4-yl-phenyl)thiophene-2-sulfonamide 5-chloro-N-(2,5-diethoxy-4-morpholino-phenyl)thiophene-2-sulfonamide MLS000098825 cid_2123690
Type:
Small organic molecule
Emp. Form.:
C18H23ClN2O5S2
Mol. Mass.:
446.969
SMILES:
CCOc1cc(N2CCOCC2)c(OCC)cc1NS(=O)(=O)c1ccc(Cl)s1
: