Target
Alkaline phosphatase, germ cell type
Ligand
BDBM34392
Substrate
Meas. Tech.
Luminescent assay for HTS discovery of chemical inhibitors of placental alkaline phosphatase
IC50
3110±140 nM
Citation
 PubChem, PC Luminescent assay for HTS discovery of chemical inhibitors of placental alkaline phosphatase PubChem Bioassay (2007)[AID] 
Target
Name:
Alkaline phosphatase, germ cell type
Synonyms:
ALPG ALPPL2 PPBN_HUMAN | placental-like alkaline phosphatase preproprotein
Type:
PROTEIN
Mol. Mass.:
57374.31
Organism:
Homo sapiens (Human)
Description:
ChEMBL_29964
Residue:
532
  
Inhibitor
Name:
BDBM34392
Synonyms:
5-[2-(3,4-dihydroxyphenyl)-2-oxoethyl]sulfanyl-2-propan-2-yl-2H-imidazo[1,2-c]quinazolin-3-one 5-[[2-(3,4-dihydroxyphenyl)-2-keto-ethyl]thio]-2-isopropyl-2H-imidazo[1,2-c]quinazolin-3-one 5-{[2-(3,4-dihydroxyphenyl)-2-oxoethyl]thio}-2-isopropylimidazo[1,2-c]quinazolin-3(2H)-one SMR000030419 | cid_3242486
Type:
Small organic molecule
Emp. Form.:
C21H19N3O4S
Mol. Mass.:
409.458
SMILES:
CC(C)C1N=C2N(C1=O)C(SCC(=O)c1ccc(O)c(O)c1)=Nc1ccccc21
: