Target
Beta-lactamase
Ligand
BDBM39832
Substrate
Meas. Tech.
Inhibition Assay
pH
7±0
Ki
5.5e+3±n/a nM
Citation
 Tondi, DPowers, RACaselli, ENegri, MCBlázquez, JCosti, MPShoichet, BK Structure-based design and in-parallel synthesis of inhibitors of AmpC beta-lactamase. Chem Biol 8:593-611 (2001)  
Target
Name:
Beta-lactamase
Synonyms:
AMPC_ECOLI Beta-lactamase (AmpC) Cephalosporinase ampA | ampC
Type:
Protien
Mol. Mass.:
41561.62
Organism:
Escherichia coli
Description:
P00811
Residue:
377
  
Inhibitor
Name:
BDBM39832
Synonyms:
Amide and sulfonamide derivatives, 16
Type:
Small organic molecule
Emp. Form.:
C8H13BN2O4S
Mol. Mass.:
244.076
SMILES:
CN(C)S(=O)(=O)Nc1cccc(c1)B(O)O
: