Target
Beta-lactamase
Ligand
BDBM39837
Substrate
Meas. Tech.
Inhibition Assay
pH
7±0
Ki
8.3e+3±n/a nM
Citation
 Tondi, DPowers, RACaselli, ENegri, MCBlázquez, JCosti, MPShoichet, BK Structure-based design and in-parallel synthesis of inhibitors of AmpC beta-lactamase. Chem Biol 8:593-611 (2001)  
Target
Name:
Beta-lactamase
Synonyms:
AMPC_ECOLI Beta-lactamase (AmpC) Cephalosporinase ampA | ampC
Type:
Protien
Mol. Mass.:
41561.62
Organism:
Escherichia coli
Description:
P00811
Residue:
377
  
Inhibitor
Name:
BDBM39837
Synonyms:
Amide and sulfonamide derivatives, 21
Type:
Small organic molecule
Emp. Form.:
C13H11BN2O5
Mol. Mass.:
286.048
SMILES:
OB(O)c1cccc(NC(=O)c2cccc(c2)N(=O)=O)c1
: