Target
Beta-lactamase
Ligand
BDBM39847
Substrate
Meas. Tech.
Inhibition Assay
pH
7±0
Ki
8.6e+2±n/a nM
Citation
 Tondi, DPowers, RACaselli, ENegri, MCBlázquez, JCosti, MPShoichet, BK Structure-based design and in-parallel synthesis of inhibitors of AmpC beta-lactamase. Chem Biol 8:593-611 (2001)  
Target
Name:
Beta-lactamase
Synonyms:
AMPC_ECOLI Beta-lactamase (AmpC) Cephalosporinase ampA | ampC
Type:
Protien
Mol. Mass.:
41561.62
Organism:
Escherichia coli
Description:
P00811
Residue:
377
  
Inhibitor
Name:
BDBM39847
Synonyms:
Amide and sulfonamide derivatives, 31
Type:
Small organic molecule
Emp. Form.:
C18H16BClN2O5S2
Mol. Mass.:
450.724
SMILES:
OB(O)c1cccc(NS(=O)(=O)c2ccc(CNC(=O)c3ccc(Cl)cc3)s2)c1
: