Target
Beta-lactamase
Ligand
BDBM39848
Substrate
Meas. Tech.
Inhibition Assay
pH
7±0
Ki
1.02e+3±n/a nM
Citation
 Tondi, DPowers, RACaselli, ENegri, MCBlázquez, JCosti, MPShoichet, BK Structure-based design and in-parallel synthesis of inhibitors of AmpC beta-lactamase. Chem Biol 8:593-611 (2001)  
Target
Name:
Beta-lactamase
Synonyms:
AMPC_ECOLI Beta-lactamase (AmpC) Cephalosporinase ampA | ampC
Type:
Protien
Mol. Mass.:
41561.62
Organism:
Escherichia coli
Description:
P00811
Residue:
377
  
Inhibitor
Name:
BDBM39848
Synonyms:
Amide and sulfonamide derivatives, 32
Type:
Small organic molecule
Emp. Form.:
C18H17BN2O5S2
Mol. Mass.:
416.279
SMILES:
OB(O)c1cccc(NS(=O)(=O)c2ccc(CNC(=O)c3ccccc3)s2)c1
: