Target
Steroidogenic factor 1
Ligand
BDBM39457
Substrate
Meas. Tech.
Dose-response cell-based assay for activators of the nuclear receptor Steroidogenic Factor 1 (SF-1)
EC50
>1222±n/a nM
Citation
 PubChem, PC Dose-response cell-based assay for activators of the nuclear receptor Steroidogenic Factor 1 (SF-1) PubChem Bioassay (2007)[AID] 
Target
Name:
Steroidogenic factor 1
Synonyms:
AD4BP FTZF1 NR5A1 SF-1 STF-1 Steroid hormone receptor Ad4BP
Type:
Nuclear Hormone Receptor
Mol. Mass.:
51643.43
Organism:
Homo sapiens (Human)
Description:
Residue:
461
  
Inhibitor
Name:
BDBM39457
Synonyms:
MLS000039439 N-(5-cyclohexyl-1,3,4-thiadiazol-2-yl)-2-furancarboxamide SMR000038200 | cid_665745
Type:
Small organic molecule
Emp. Form.:
C13H15N3O2S
Mol. Mass.:
277.342
SMILES:
O=C(Nc1nnc(s1)C1CCCCC1)c1ccco1
: